Популярные вопросы по тегу SELENIUM-CHROMEDRIVER

Как сделать хромированную отвертку необнаружимой

... отказ в обслуживании». Однако 10 я не могу найти, где эти теги даже находятся 9 в консоли браузера или в исходном коде. Я 8 предполагаю, что это отвечает за обнаружение 7 chromedriver, однако после прочесывания 6 исходного кода я не смог найти этот интерфейс. В 5 результате у меня возник вопрос, включена 4 ли эта функция в текущий хромированный драйвер. В 3 противном случае я все еще знаю, что текущий 2 хромодрайвер обнаруживается веб-сайтам ...

Конфигурация прокси socks с драйвером selenium chrome

... Proxy proxy = new Proxy(); proxy.setProxyType(Proxy.ProxyType.MANUAL); proxy.setAutodetect(false); proxy.setSocksProxy(ProxyHelper.PROXY_HOST + ":" + ProxyHelper.PROXY_PORT); DesiredCapabilities capabilities = DesiredCapabilities.chrome(); capabilities.setCapability(CapabilityType.PROXY, proxy); WebDriver chromeDriver = new ChromeDriver(capabilities); Эта конфигурация 6 дает: Exception in thread "main" org.openqa.selenium.We ...

Selenium chromedriver отключить ведение журнала или перенаправить его java

... nnections are allowed. ott 24, 2018 7:52:01 PM org.openqa.selenium.remote.ProtocolHandshake createSession INFORMAZIONI: Detected dialect: OSS Я вызываю водителя следующим образом: WebDriver driver = null; try { System.setProperty("webdriver.chrome.driver", "/usr/local/bin/chromedriver"); ChromeOp ...

Как разрешить или запретить всплывающее уведомление о геолокации микрофона камеры

... ля открытия всплывающего 2 окна аутентифик ...

Как сохранить сеанс веб-сайта WhatsApp с помощью Selenium Python?

... kies()) time.sleep(30) # We are doing the manual QR code verification here print(driver.get_cookies()) driver.get_cooki ...

Селен в Python на Mac - исполняемый файл Geckodriver должен находиться в PATH

... ь его в 9 разные папки (в той же папке, что и файл 8 python, в той же папке, что и файл webdriver, в 7 корзине пользователя и т. Д.), Но получаю 6 ту же ошибку Я рассмотрел похожие вопросы, но 5 не нашел подходящего варианта. Я также пробовал 4 использовать Chrome, но получаю ту же ошибку, но 3 с chromedriver. which geckodriver дает /usr/local/bin/geckodriver Я тоже использую Mac, поэтому 2 пути к файла ...

InvalidArgumentException: сообщение: недопустимый аргумент: каталог данных пользователя уже используется ошибка с использованием --user-data-dir для запуска Chrome с использованием Selenium

... lib\site-packages\selenium\webdriver\remote\webdriver.py", line 321, in execute self.error_handler.check_response(response) File "C:\Program Files (x86)\Python\lib\site-packages\selenium\webdriver\remote\errorhandler.py", line 242, in check_response raise exception_class(message, screen, stacktrace) selenium.common.exceptions.InvalidArgumentE ...

ОШИБКА: ssl_client_socket_openssl.cc (1158)] не удалось выполнить рукопожатие в браузере ChromeDriver Chrome и Selenium.

... его скрипта python selenium 7 с драйвером Chrome я получаю около трех 6 из приведенных ниже сообщений об ошибках 5 каждый раз, когда загружается страница, даже 4 если все работает нормально. Есть ли способ 3 подавить эти сообщения? ...

Как открыть новую вкладку в Chrome с помощью Selenium-chromeDriver в Python

... ml в Chrome: driver = webdriver.Chrome("/usr/bin/chromedriver") driver.get("localhost:3000") Затем я хочу 4 открыть localhost:3000/cloudPeer.html в новой вкладке: driver.find_element_by_tag_name("body").send_keys(Keys.CONTROL + 't') driver.get("localhost:3000/cloudPeer.html") Это хорошо работает ...

Проблема с Chromedriver в режиме Headless

... ce(WebDriver driver, String browserName){..} Мои журналы показывают мне эту 7 последовательность, тестовые примеры не 6 выполняются полностью и вызывается следующий 5 тестовый пример - INFO learning.helpers.DriverInitialisor - createInstance - 111 - Ru ...

Вкладки переключателя Selenium ChromeDriver

... ); Но 1 это вызывает следующее исключение: ekmLiveChat.tests.UITests.EndToEndTest.EndToEnd: System.ArgumentException : key must be a modifier key (Keys.Shift, Keys.Control, or Keys.Alt) Parameter name: key Есть ли способ переключать вкладк ...

Шаги по установке и запуску безголового браузера Chrome на CentOS 6.5 с использованием драйвера Chrome

... дь предоставить 5 шаги и ссылку для скачивания chrome-61 и 4 то, как его установить. В моей операционной 3 системе нет графиче ...

ChromeDriver (возможности возможностей) устарел

... OWNLOAD_FOLDER_ROOT); DesiredCapabilities caps = DesiredCapabilities.chrome(); ChromeOptions options = new ChromeOptions(); options.addArguments("--start-maximized"); options.setExperimentalOption("prefs", prefs); caps.setCapability(ChromeOptions.CAPABILITY, options); driver = new ChromeDriver(caps); Я нашел 4 это в документации: Вместо этого испо ...

node.js жалуется, что «ChromeDriver не может быть найден в текущем PATH», хотя chromedriver находится на пути

... davea/mydir/js/Optimus.js:14:4) at Module._compile (module.js:413:34) at Object.Module._extensions..js (module.js:422:10) at Module.load (module.js:357:32) at Function.Module._load (module.js:314:12) Он говорит, что chromedriver 5 не на моем пути, но я только что загрузил 4 соответствующую версию отсюда - http://chromedriver.stora ...

USB: usb_device_handle_win.cc:1020 Не удалось прочитать дескриптор из ошибки подключения узла с ChromeDriver v87 / Chrome v87 с использованием Selenium в Windows10

... л ошибок: [9848:10684:1201/013233.169:ERROR:device_event_log_impl.cc(211)] [01:32:33.170] USB: usb_device_handle_win.cc:1020 Failed to read descriptor from node connection: A device attached to the system is not functioning. (0x1F) Минимальный 4 блок кода: from selenium import webdriver options = webdriver.ChromeOptions() options.add_argument("start-maximized") driver = webdriver.Chrome(options=options, executable_path=r'C:\W ...

SessionNotCreatedException: сообщение: сеанс не создан: эта версия ChromeDriver поддерживает только версию Chrome 81

... ком с фреймворком 10 для роботов. В настоящее время я использую 9 последнюю оконную версию chrome и chromedriver, которая 8 составляет 80, но когда я пытаюсь запустить 7 тест, появляется сообщение "SessionNotCreatedException ...

WebDriverError: отключен: невозможно подключиться к рендереру

... 3f6b99b6105061) ~ $ echo $JAVA_HOME /Library/Java/JavaVirtualMachines/jdk1.7/Contents/Home ~ $ node -v v6.11.2 Браузер: Chrome 7 версии 62.0.3202.62 (официальная сборка) (64-разрядная 6 версия) Версия браузера: 62.0.3202.62 (официальная 5 сборка) (64-разрядная версия) Ожидаемое поведение 4 - Сеанс Chrome до ...

Блокировка входа в Selenium Google

... Я ищу решение. Можно ли получить 8 файл cookie обычного Firefox / Chrome и 7 загрузить его в ChromeDriver / GeckoDriver? Я 6 думал, что это может быть решением. Но я 5 не уверен, возможно это или нет .. Ищем решения 4 ... Также я хочу добавить быстрое решение. Я ...

Элемент не взаимодействует в Selenium Chrome Headless Mode

... m.webdriver import Chrome from selenium.webdriver.chrome.options import Options from selenium.webdriver.support.ui import WebDriverWait from selenium.webdriver.common.by import By import time options = Options() options.add_argument('headless') options.add_argument('window-size=1366x768') with Chrome(options=options) as driver: driver.get('https://accounts.google.com/login') ...

Запуск Chrome через Selenium

... 2 следующая ошибка: selenium.common.exceptions.WebDriverException: Message: 'ChromeDriver executable needs to be available in the path. Эта ошибка возникает для 1 следующей строки: driver = webdriver.Chrome(executable_path='path\to\chromedriv ...

WebDriverError: нет такой ошибки сеанса с использованием ChromeDriver Chrome через Jenkins и Selenium

... того? Есть ли сбой подключения или это 5 по какой-то другой причине (я использую 4 около 26 сценариев, и по крайней мере один 3 сценарий не имеет такой ошибки сеанса) Скрипты 2 - это разные скрипты, и ни одна такая о ...

Стратегия загрузки страницы для драйвера Chrome (обновлено до Selenium v3.12.0)

... раничить время загрузки. В 5 FireFox я знаю о PAGE_LOAD_STRATEGY = "eager". Есть что-то подобное для 4 Chrome? P.S .: driver.manage().timeouts().pageLoadTimeout() работает, но после этого 3 при любом обращении к Web ...

WebDriver против ChromeDriver

... ица между ChromeDriver driver = new ChromeDriver(); и WebDriver driver = new ChromeDriver(); ? Я 4 видел, как оба они используются в различных 3 руководствах, пр ...

Как отключить "navigator.webdriver" в chromedriver?

... пособов, которые 9 просто работали бы. Единственный способ, который 8 я смог найти, - это установить для параметра 7 «pageLoadingStrategy» значение «нетерпеливо», а 6 затем немедленно выполнить некоторый javascript, чтобы 5 он мог изменить значение navigator.webdriver до отображения 4 страницы. Но т ...

Невозможно вызвать стандартную команду, отличную от W3C, в режиме W3C (Selenium :: WebDriver :: Error :: UnknownCommandError) с Selenium ChromeDriver в Cucumber Ruby

... hromeDriver 9 поддерживает только Chrome версии 75», на 8 этот раз мы использовали ChromeDriver 2.46 7 и браузер google-chrome-unstable, используя 6 следующую команду: #Chrome RUN wget -q -O - https://dl-ssl.google.com/linux/linux_signing_key.pub | apt-key add - RUN echo "deb http://dl.google.com/linux/chrome ...

Невозможно развернуть окно Chrome в режиме без головы

... Linux 4.2.0-27-generic x86_64) (ПРЕДУПРЕЖДЕНИЕ: сервер 24 не предоставил никакой информации о трассировке 23 стека) Длительность или тайм-аут команды: 108 22 миллисекунд Информация о сборке: версия: '2.53.1', редакция: 'a36b8b1cd5757287168e54b817830adce9b0158d', время: '2016-06-30 19:26:09 21 'Системная информация: host:' bb-blr-prod-stage-stg1-01 ...

Как обновить chromedriver до последней версии на MacOS Catalina с помощью homebrew?

... 03.39 Когда я открываю 2 Терминал и открываю: brew cask install chromedriver В нем говорится: Warning: Cask 'chromedriver' is ...

Не удалось прочитать дескриптор из соединения узла: устройство, подключенное к системе, не работает ошибка с использованием ChromeDriver Selenium в ОС Windows

... равно получаю эту ошибку: [8552:6856:1120/155118.770:ERROR:device_event_log_impl.cc(211)] [15:51:18.771] USB: usb_device_handle_win.cc:1020 Failed to read descriptor from node connection: A device attached to the system is not functioning. (0x1F) [8552:6856:1120/155118.774:ERROR:device_event_log_impl.cc(211)] [15:51:18.774] USB: usb_device_handle_ ...

Образ докера с python3, chromedriver, хромом и селеном

... поискал и не нашел образа докера 6 со всем следующим установленным: Python 3 ChromeDriver Chrome Selenium Может ли 5 кто-нибудь связать меня с docker image со всеми этими 4 установленными и работающими ...

Отображение ошибки невозможно удалить файл chromedriver.exe при запуске проекта Selenium в Visual Studio

... \visual studio 2017\Project\SeleniumTestProject\SeleniumTestProject\bin\Debug\chromedriver.exe' is denied. Я удалил 4 атрибут readonly для папки, но по-прежнему получаю 3 эту ошибку. Может ли кто-ни ...

Невозможно найти элементы на веб-странице с безголовым хромом

... ble-gpu") chrome_options.add_argument("--window-size=1920x1080") self.browser = webdriver.Chrome(chrome_options=chrome_options) # Ignore lack of cert for each printer web page. # Otherwise, can't open page. self.browser.accept_untrusted_certs = True Способ 2 входа: def login(self): """Navigates through the login page for the printe ...

Неизвестная ошибка: не удалось запустить Chrome: аварийный выход (информация о драйвере: chromedriver = 2.9

... Chrome, чтобы 4 убедиться, что это не проблема с jenkins: curl -X POST -H "Content-Type: application/json; charset=utf-8" -d "{\"desiredCapabilities\":{\"platform\":\"ANY\",\"browserName\":\"chrome\",\"chromeOptions\":{\"args\":[],\"extensions\":[]},\"version\":\"\",\"chrome.switches\":[]}}&quo ...

Selenium ChromeDriver, как отключить сообщение: «DevTools на WS

... рного поиска с помощью 3 этих команд: ChromeOptions option = new ChromeOptions(); option.AddArgument("--headless"); option.AddArgument("--silent"); option.AddArgument("--disable-gpu"); option.AddArgument("--log-level=3"); ChromeDriverService service = ChromeDriverService.CreateDefaultService(); s ...

Заварить установить хромедрайвер не работает?

... romedriver с помощью homebrew brew install chromedriver Я получаю: Error: No available formula with the name "chromedriver" It was migrated from homebrew/core to caskroom/cask. You can acce ...

Где найти 64-битную версию chromedriver.exe для Selenium WebDriver?

... рсию chromedriver.exe? Я пробовал 2 его и с 32-битной версией, но он не вызывает ...

Как сохранить открытую страницу как pdf в Selenium (Python)

... ROMEDRIVER_PATH = '/usr/local/bin/chromedriver' driver = webdriver.Chrome(options=options, executable_path=CHROMEDRIVER_PATH) driver.implicitly_wait(5) driver.get(url) driver.execute_script('window.print();') $chromedriver --v ChromeDriver 75.0.3770.90 (a6dcaf7e3ec6f70a194cc25e ...

Selenium Chrome не может видеть журналы браузера InvalidArgumentException

... я HTTP после открытия веб-сайта 6 с помощью selenium webdriver с Python, я 5 обнаружил, что получение кода состояния HTTP невозможно, поэтому 4 единственный способ - чтобы получить сетевые 3 журналы и получить оттуда код состояния HTTP поэтому я пытаюсь 2 распечатать журналы в селене, но это дает 1 мне InvalidArgumentException from selenium import webdriver from selenium.webdriver.common.desired_capabilities import DesiredCapabilities # en ...

Как включить chromedriver с pyinstaller?

... aller myscript.py он приведет к включению Firefox 9 вместо Chrome. В результирующей папке c: ... \ dist 8 \ myscript \ selenium \ webdriver есть папка 7 firefox, поэтому она просто пропускает chromedriver, и 6 для меня это серьезная проблема, потому 5 что скрипт должен запускаться с Chrome. Есть 4 только несколько вопросов по этой теме, но 3 нет ответа, чтобы решить проблему. Я думал 2 добавить в команду тег --h ...

Как использовать браузер Brave с python, selenium и chromedriver?

... льзуют 6 одну и ту же версию, как эта, ~/some/path $ chromedriver --version ChromeDriver 76.0.3809.126 (d80a294506b4c9d18015e755cee48f953ddc3f2f-refs/branch-heads/3809@{#1024}) Мой хромированный 5 драйвер также находится в /user/bin, ~/path $ cd /usr/bin/ /usr/bin $ ls | grep chromedriver chromedriver И чтобы проверить 4 версию Brave, я получаю: Version 0.68.132 Chromium: 76.0.3809.132 (Official Buil ...

Как замедлить скорость действия send_keys в скрипте Selenium с помощью Python?

... ет это правильно. Однако для наблюдения 4 мне нужно снизить скорость, с которой send_keys 3 заполняет тексто ...

Chomedriver "Неисполняемый драйвер

... ns(); DesiredCapabilities capabilities = DesiredCapabilities.firefox(); LoggingPreferences log_prefs = new LoggingPreferences(); log_prefs.enable(LogType.BROWSER, Level.SEVERE); capabilities.setCapability(CapabilityType.LOGGING_PREFS, log_prefs); System.setProperty("webdriver.chrome.driver", "chromedriver"); driver = new ChromeDriver(capabilities); driver.manage().window().maximize(); И это нормально для 4 локальных око ...

Исключение Webdriver: «хром недоступен.

... ормация о драйвере: chromedriver 5 = 2.8.240825, платформа = Linux 2.6.32-431.el6.x86_64 4 x86_64) (ВНИМАНИЕ: сервер не предоставил 3 никакой информации о трассировке стека) [ошибка] Длительность 2 команды или тайм-аут: 20,83 секунды Привет. Ниже 1 приведен небольшой фрагмент моего кода: public class Integra ...

Как получить localStorage с помощью Python и Selenium WebDriver

... t_cookies() получить LocalStorage вместо 1 фа ...

WebDriverException: неизвестная ошибка: файл DevToolsActivePort не существует при попытке запустить браузер Chrome

... =2.39.562718 (9a2698cba08cf5a471a29d30c8b3e12becabb0e9),platform=Windows NT 10.0.15063 x86_64) (WARNING: The server did not provide any stacktrace information) Моя конфигурация: ...

NoSuchElementException, Selenium не может найти элемент

... TextField в селене, но 4 не знаю, как это сделать (впервые использую 3 селениум). Я пробовал: driver.findElement(By.id(" ...

Как избавиться от информационной панели "Chrome контролируется программой автоматического тестирования" через Selenium

... rowser = webdriver.Chrome() #first tab browser.get(('www.testwebsite.com?')) # fill in username and hit the next button username = browser.find_element_by_id('username') username.send_keys(usernameStr) password = WebDriverWait(browser, 10).until( EC.presence_of_element_located((By.ID, 'password'))) password.send_keys(passwordStr) nextButton = browser.f ...

Селен - ссылка на устаревший элемент: элемент не прикреплен к странице

... . Я проверил 12 другие посты, но так и не понял. Как я могу 11 это решить? Насколько я читал, селен дает 10 гораздо более быстрый ответ, чем время открытия 9 веб-сайта, поэтому он выдает ошибку. Кроме 8 того, изредка это прив ...

Скомпилируйте ChromeDriver на ARM

... кт Chromium использует множество незнакомых 6 мне инструментов для компиляции исходного 5 кода, я даже не смог запустить процесс. Я 4 часами искал в Интернете, как скомпилировать 3 его для семейства ARM, но не смог найти 2 ни учебника, ни даже успешной истории по 1 этому поводу. Итак, у меня два вопроса: Это выполнимо? Кто-нибудь знает, что я могу ...

Как настроить ChromeDriver для запуска браузера Chrome в режиме Headless через Selenium?

... ый файл .exe. Смотрите 6 скриншот того, о чем я говорю. Screenshot Это код, который 5 я использую для запуска ChromeDriver: options = webdriver.ChromeOptions() options.add_experimental_option("excludeSwitches",["ignore-certificate-errors"]) options.add_argument('headless') options.add_argument('window-size=0x0') chrome_driver_path = "C:\Python27\Scripts\chromedriver.ex ...

Как reCAPTCHA 3 узнает, что я использую Selenium / chromedriver?

... но, как работает reCAPTCHA v3. В 13 частности, отпечатки пальцев браузера. Когда 12 я запускаю экземпляр Chrome через Selenium 11 / chromedriver и тестирую его на reCAPTCHA 10 3 (https://recaptcha-demo.appspot.com/recaptcha-v3-request-scores.php), я всегда получаю 0,1 при использовании 9 Selenium / chromedriver. При использовании 8 инкогнито с обычным экземпляром я получаю 7 0,3. Я превзошел другие системы обнаружения, внедр ...