Популярные вопросы по тегу COMPILER-ERRORS

Не удалось загрузить файл или сборку ... Неверный параметр

... альная, PublicKeyToken 8 = b9a188c8922137c6 'или одна из его зависимостей. Неверный 7 параметр. (Исключение из HRESULT: 0x80070057 6 (E_INVALIDARG)) Это не зависит ни от моего 5 кода, ни от имени сборки (например, Ne ...

Получение ошибки при использовании типа "React.ReactNode" для детей. Какой тип я должен использовать?

... ype 'Element': type, props, key. ts(2786) Я не знаю, как исправить эту ошибку, я 2 перепробовал почти все, может ли кто-нибудь 1 помочь? :) export type LoaderIndicatorProps = { loading: boolean; children?: React.ReactNode; }; export function LoaderIndicator(props: LoaderIndicatorProps) { const { loading, children } = props; if (loading) { return ( <div> <Container&g ...

Android java.exe завершился с ненулевым значением выхода 1

... : org.gradle.process.internal.ExecException: Process 'command 'C:\Program Files (x86)\Java\jdk1.7.0_67\bin\java.exe'' finished with non-zero exit value 1 Вот что отображала консоль: Executing tasks: [:app:assembleDebug] Configuration on demand is an incubating feature. :app:preBuild UP-TO-DATE :app:preDebugBuild UP-TO-DATE :app:compileDebugNdk UP-TO-DATE :app:checkDebugManifest :app:preReleaseBuild UP- ...

Ошибка ссылки GLFW MinGW

... e.Debug:77: recipe for target 'debug\Test.exe' failed mingw32-make[1]: Leaving directory 'A:/workspace_cpp/Test-Debug' Makefile:34: recipe for target 'debug' failed c:/mingw/bin/../lib/gcc/mingw32/4.8.1/../../../libglfw3.a(win32_monitor.c.obj):win32_monitor.c:(.text+0x370): ...

LinkedList не является общей "ошибка Java

... орится: Исключение 5 в потоке "main" java.lang.Error: Нерешенная 4 проблема компиляции: Тип LinkedList не 3 является универсальным; его нельзя параметризовать 2 аргументами на LinkedList.main (LinkedList.java:7) Кто-нибудь знает, как исправить 1 эту ошибку? Вот программа: import java.util.*; public class LinkedList { ...

Что означают сообщения об ошибках внутреннего компилятора и что я могу сделать?

... , в которой используются библиотеки 8 MPICH и NAG C (я использую NAG для генерации 7 случайных чисел), с помощью компилятора 6 pgCC. Однако компилятор выдал мне следующее 5 сообщение об ошибке: PGCC-S-0000-Internal compiler error. linearize: bad ili #: 0 (mpisim.C: 225) PGCC-S-0000-Internal compiler error. gen_aili: unrec. ili opcode: 0 (mpisim.C: 225) PGCC-S-0000-Internal compiler error. linearize: bad ili #: 0 (mpisim.C: 266 ...

Как принудительно выполнить ошибку, когда функция не имеет возврата в gcc?

... обы 9 прервать сборку), если определение функции 8 не имеет возврата в своем теле? Рассмотрим 7 эту функцию: int sum(int a, int b) { int c = a + b; // and here should be return }; Когда я компилирую с помощью 6 g++ -Wall, я получаю: нет оператора return в функции, возвращающей 5 непустой [-Wreturn-type] но я хо ...

C#: проверьте, является ли тип T bool

... l) // <-- what is the correct syntax here? return (T)true; // <-- I don't think this works either } РЕДАКТИРОВАТЬ: Извините, я 3 не упомянул, ...

Ошибка: класс не был объявлен, несмотря на включение заголовка, и код компилируется нормально в другом месте

... ь 10 минимальный пример, который мог бы воспроизвести 9 это. Так что мой вопрос гораздо более общий; какие 8 вещи могут вызвать это? Есть ли что-то конкретное, что 7 мне следует искать, или какое-то направление 6 расследования, по которому я должен следовать, чтобы 5 отследить это? Этот код отлично компилируется 4 в почти идентичной версии проекта. Мы будем 3 благодарны за любу ...

Небезопасный HTTP-запрос не поддерживается "Ошибка в Scala

... ыло добавленной 6 части разрешения раньше, когда мой код работал 5 нормально. Он был добавлен как попытка решить 4 проблему, но не сработал): scalaVersion := "2.12.10" name := "name" organization := "org" version := "1.0" libraryDependencies ++= Seq( "org.scala-lang.modules& ...

ASP.NET, как устранить ожидаемую ошибку CS1513:} на странице

... c:\Windows\Microsoft.NET\Framework\v1.1.4322\ Temporary ASP.NET Files\xxxxxxxx\450ffa78\d46d847d\ k1gsz9dj.0.cs Line: 331 Я не могу 7 найти ни одного отсутствующего} в моем исходном 6 коде, и эта ошибка возникает в файлах сгенерированного 5 кода, которые существуют в каталоге временных 4 файлов ASP.NET. Как я могу отследить это 3 до строки кода, которая на са ...

Что не так с объявлением массива: «недопустимая цифра в восьмеричной константе»?

... }; Я получаю следующую ошибку q11.c:8:10: error: invalid digit "8" in octal constant q11.c:8:67: error: invalid digit "8" in octal constant q11.c:15:49: error: invalid digit "8" in octal constant q11.c:17:19: error: invalid digit "9" in octal constant q11.c:18:58: error: invali ...

Где находится метод Deconstruct структуры KeyValuePair <>?

... 14 что год назад я спросил: What is the purpose of Deconstruct method in KeyValuePair&lt;&gt; struct? Но теперь я просто 13 не могу найти его или никаких следов его 12 удаления, никаких вопросов, ничего. Компилятор 11 соглашается: var s = new KeyValuePair&lt;int, int&gt;(1, 3); var (x, y) = s; Ошибка CS1061 &quot;KeyValuePair&quot; не 10 содержит определения. для 'Deconstruct' и 9 недоступного метода р ...

Ошибка компилятора c # CS1526: новое выражение требует(), [] или {} после типа

... del; using System.Data; using System.Drawing; using System.Linq; using System.Text; using System.Windows.Forms; namespace Session3 { public partial class Form1 : Form { public Form1() { InitializeComponent(); } private void button1_Click(object sender, EventArgs e) { Vehicle my_Car = new Vehicle; } } class Vehicle { uint mileage; ...

Ошибка javac: «пакет x не существует» при импорте x

... "; check4prime.checkArgs(args); fail("Should raise an Exception."); } catch (Exception success) { //successful test } } // end testCheck4Prime_checkArgs_neg_input() //Test case 6 public void testCheck4Prime_checkArgs_2_inputs() { try { String [] args= new St ...

Ошибка при назначении члена в объекте только для чтения

... ion_length &lt;&lt; endl; trace_dump &lt;&lt; "#Trace file dumped by worm_sim from node " &lt;&lt; id &lt;&lt; endl; trace_dump &lt;&lt; "#Folloing lines are with format as:" &lt;&lt; endl &lt;&lt; "#timestamp\t" &lt;&lt; ...

Неудовлетворенная форвардная или внешняя декларация

... Exception.CheckSchemeFinMethodDAException." Кто-нибудь 3 знает, что означает эта ошибка? Означает 2 ли это, что CheckSchemeFinMethodDAException вызывается не во всех соответствующих 1 ...

c ++ неопределенный символ при компиляции

... : testTree.cc tree.h node.h check.h g++ -c -Wall -Werror testTree.cc tree.o: tree.h tree.cc node.h check.h g++ -c -Wall -Werror tree.cc node.o: node.h node.cc check.h g++ -c -Wall -Werror node.cc check.o: check.h check.cc g++ -c -Wall -Werror check.cc clean: rm -f *~ *.o p4 Соответствующий код из tree.cc 2 и tree.h: tree.cc ... bool Tree::inTree(int k) const { return locate(k,root) != NULL; } ... tree.h #ifn ...

rvm install 2.6.7 всегда терпел неудачу на Apple M1 mac

... 6.7 ruby-2.6.7 - #removing src/ruby-2.6.7 - please wait Searching for binary rubies, this might take some time. No binary rubies available for: osx/11.5/x86_64/ruby-2.6.7. Continuing with compilation. Please read 'rvm help mount' to get more information on binary rubies. Checking requirements for osx. Certificates bundle '/opt/homebrew/etc/[email protected]/cert. ...

Пытаюсь включить библиотеку, но продолжаю получать сообщения "неопределенная ссылка на"

... x86/main.o.d -o build/Debug/GNU-Linux-x86/main.o main.c mkdir -p dist/Debug/GNU-Linux-x86 gcc -o dist/Debug/GNU-Linux-x86/cproj1 build/Debug/GNU-Linux-x86/main.o build/Debug/GNU-Linux-x86/main.o: In function 'main': /home/[[myusername]]/NetBeansProjects/CProj1/main.c:18: undefined reference t ...

Ошибка: недопустимое использование нестатического элемента данных

... s Stack { private: int tos; const int max = 10; int a[max]; public: ...

JNI - «Невозможно открыть включаемый файл: 'jni_md.h'

... написанный на c #include &lt;C:\Program Files\Java\jdk1.7.0\include\jni.h&gt; #include &lt;C:\Program Files\Java\jdk1.7.0\include\win32\jni_md.h&gt; #include &lt;stdio.h&gt; #include "HelloWorld.h" JNIEXPORT void JNICALL Java_HelloWorld_print( JNIENv *env , jobject obj) { printf("Hello World!\n"); return; } Я получаю ошибку при компиляции: fatal error C1083: Cannot open include file: 'jni_md.h': No such file or directory Также 3 мой ...

Xcode "Невозможно проанализировать содержимое Info.plist.

... щение об ошибке: couldn't parse contents of '/Users/...Info.plist': The data couldn’t be read because it isn’t in the correct format. Я понятия ...

ServletException, HttpServletResponse и HttpServletRequest не могут быть преобразованы в тип

... лько маркеров на 1 этой строке Исключение ServletException не может быть разрешено в тип HttpServletResponse не может быть разрешен типу HttpServletR ...

Ошибка компиляции C: тип массива имеет неполный тип элемента

... NUMBER array[99999]; return 0; } Я получаю ошибку компиляции: error: array type has incomplete element type Я считаю, что 3 проблема в том, что я неправильно объявляю 2 массив структур. Когда я поискал, пох ...

Никакая перегрузка для 'метода' не соответствует делегату 'System.EventHandler'

... imeSpan.FromMilliseconds(5000); t1.IsEnabled = true; t1.Tick += new EventHandler(OnTimed); t1.Start(); } void OnTimed(object sender, ElapsedEventArgs e) { imgCapture.Source = imgVideo.Source; System.Threading.Thread.Sleep(1000); Helper.SaveImageCapture((BitmapSource)imgCapture.Source); } Когда я запускаю 3 код, он показывает ошибку: «Нет перегрузки 2 для 'метода', соответствующего деле ...

Как отформатировать указатели с помощью библиотеки fmt?

... sion did not evaluate to a constant 1&gt;c:\users\steve\source\fmt\include\fmt\core.h(1073): note: a non-constant (sub-)expression was encountered 1&gt;c:\users\steve\source\fmt\include\fmt\core.h(1197): error C2131: expression did not evaluate to a constant 1&gt;c:\users\steve\source\fmt\include\fmt\core.h(1082): note: failure was caused by non-constant arguments or reference to a ...

Используйте команду «паника: ошибка времени выполнения: индекс вне допустимого диапазона», если длина массива не равна нулю.

... [running]: panic(0x1045a0, 0x1040a010) /usr/local/go/src/runtime/panic.go:500 +0x720 main.myFunc(0x114130, 0x4, 0x0, 0x0, 0x0, 0x3ba3) /tmp/sandbox960520145/main.go:19 +0x1a0 main.main() /tmp/sandbox960520145/main.go:10 +0x40 Я 4 ...

Ошибка компилятора привязки данных: «Не удается разрешить тип для SafeVarargs.

... tor.run(DefaultBuildOperationExecutor.java:62) at org.gradle.initialization.DefaultGradleLauncher.doBuild(DefaultGradleLauncher.java:93) at org.gradle.initialization.DefaultGradleLauncher.run(DefaultGradleLauncher.java:82) at org.gradle.launcher.exec.InProcessBuildActionExecuter$DefaultBuildController.run(InProces ...

Недопустимое использование this в функции, не являющейся членом

... blic: Gaussian(double, double); ~Gaussian(); double normalizationConstant(double); Gaussian fromPrecisionMean(double, double); Gaussian operator * (Gaussian); double absoluteDifference (Gaussian); }; файл 8 gaussian.cpp: #include "gaussian.h" #include &lt;math.h&gt; #include "constants.h" #include &lt;stdlib.h&gt; #include &lt;iostream&gt; Gauss ...

Неопределенные символы для архитектуры i386: _OBJC_CLASS _ $ _ SKPSMTPMessage ", ссылка на которую указана из: error

... k. Может ли кто-нибудь предложить, почему 5 отображается ошибка ниже Undefined symbols for architecture i386: &quot;_OBJC_CLASS_$_SKPSMTPMessage&quot;, referenced from: objc-class-ref in ConfirmController.o &quot;_kSKPSMTPPartContentTransferEncodingKey&quot;, referenced from: -[ConfirmController sendEmail] in ConfirmController.o &quot;_kSKPSMTPPartMessageKey&quot;, referenced from: -[ConfirmController sendEmail] in ...

Десериализация JSON с помощью Джексона в полиморфные типы - полный пример дает мне ошибку компиляции

... ; while (elementsIterator.hasNext()) { Entry&lt;String, JsonNode&gt; element=elementsIterator.next(); String name = element.getKey(); if (registry.containsKey(name)) { animalClass = registry.get(name); break; } } if (animalClass == null) return null; return mapper.readValue(root, animalClass); ...

Как я могу решить ошибку машинописного текста «x» не имеет инициализатора и не определенно назначен в конструкторе?

... Если 3 сделать это необязательным с помощью ?, код 2 нарушится в другом месте, где я использую 1 this.duni.nativeElement, давая Object is possibly 'undefined'.ts(2532) . Как я могу реш ...

Не удается найти модуль date-fns

... 4 узла "date-fns" с помощью import { startOfDay } from 'date-fns'; тогда я получаю 3 ошибку компиляции: error TS2307: Cannot find module 'date-fns'. Однако следующее не приводит 2 к ошибке: ...

cc1plus: error: недопустимое значение (‘tigerlake’) для ‘-march =’ switch »ошибка компиляции

... ed/project' make: *** [/home/josue/Documents/of_v0.11.0_linux64gcc6_release/libs/openFrameworksCompiled/project/makefileCommon/compile.project.mk:125: Release] Error 2 Всякий раз, когда я пытаюсь выполнить компиляцию 9 с помощью команды make в терминале, я получаю 8 эту ошибку. Программа компилируется и отлично 7 работает на моем ст ...

Info.plist пакета не содержит ключа CFBundleVersion или его значение не является строкой.

... gt;Translucent&lt;/key&gt; &lt;true/&gt; &lt;/dict&gt; &lt;/dict&gt; &lt;key&gt;UISupportedInterfaceOrientations&lt;/key&gt; &lt;array&gt; &lt;string&gt;UIInterfaceOrientationPortrait&lt;/string&gt; &lt;/array&gt; &lt;key&gt;UIViewControllerBasedStatusBarA ...

Ошибка компиляции iOS Xcode: невозможно выполнить команду: ошибка сегментации: 11

... .sh clang: note: diagnostic msg: ******************** Он показывает мне случайные файлы, которые я должен отправить в отчет об ошибке. Я не вносил никаких изменений кода из рабочей версии в версию, вызывающую текущие проблемы, и я даже вернулся к более ранней версии, к ...

Невозможно вызвать методы во всплывающей подсказке до инициализации

... }); $(o.tooltip).mouseout(function (e) {}); }, position: { my: "center bottom-20", at: "center top", using: function( position, feedback ) { $( this ).css( position ); $( "&lt;div&gt;" ) .a ...

Python3: ImportError: нет модуля с именем '_ctypes' при использовании значения из многопроцессорной обработки модуля

... ь 7 переменную x = Value('i', 2), но не в 3.4.0. Я получаю: Traceback (most recent call last): File "&lt;stdin&gt;", line 1, in &lt;module&gt; File "/usr/local/lib/python3.4/multiprocessing/context.py", line 132, in Value from .sharedctypes import Value File "/usr/local/lib/python3.4/multiprocessing/sharedctypes.py", line 10, in &lt; module&gt; import ctypes File ...

Как уснуть или отложить поток в Haskell?

... чаю одну и ту же ошибку 4 для всех этих случаев, поэтому, вероятно, я 3 делаю что-то в корне неправильно: Variable not in scope: delay :: Integer -&gt; IO a0 Это мой 2 тестовый фрагмент: main = do { putStrLn &quot;line 1&quot; ; delay 2 ; putStrLn &quot;line 2&quot; } Поиск в Google ошибки 1 по какой-то ...

Заблудший '\ 342' в программе на C++

... ror: stray ‘\342’ in program showdata.cpp:66: error: stray ‘\200’ in program showdata.cpp:66: error: stray ‘\235’ in program showdata.cpp:66: error: stray ‘\’ in program showdata.cpp:66: error: stray ‘\342’ in program showdata.cpp:66: error: stray ‘\200’ in program showdata.cpp:66: error: stray ‘\235’ in program showdata.cpp:67: error: stray ‘\342’ in program showdata.cpp:67: error: stray ‘\200’ in prog ...

Ссылочная переменная с ошибкой, должна быть инициализирована в инициализаторе базы конструктора / члена

... (string&amp; s) : s_(s) { cout &lt;&lt; "A::ctor" &lt;&lt; endl; } A(const A&amp; rhs) { cout &lt;&lt; "A::copy" &lt;&lt; endl; } ~A() { cout &lt;&lt; "A::dtor" &lt;&lt; endl; } A&amp; operator=(const A&amp; ...

Что означает «Несколько маркеров»?

... ic Set&lt;String&gt; languages = new HashSet&lt;String&gt;(); languages.add("en"); languages.add("de"); И я получаю следующее сообщение 3 об ошибке, созданное Eclipse: &gt; Multiple markers at this line &gt; - Syntax error on token ""en ...

Ошибка: ISO C++ запрещает внутриклассную инициализацию неконстантного статического члена

... ый 14 конструктор : firstName(first), перегруженный конструктор firstName lastName(last) Перегруженный 13 конструктор lastName { //The constructor start ++counter; добавляет один плюс 12 за каждый созданный объект; cout &lt;&lt; "Emp ...

@ babel / typescript не вызывает ошибок при сборке веб-пакета

... in.90f2073400581ecd9e5b.js ... ERROR in /Users/me/projects/react/src/actions/index.ts ./src/actions/index.ts [tsl] ERROR in /Users/me/projects/react/src/actions/index.ts(3,28) TS7006: Parameter 'type' implicitly has an 'any' type. ERROR in /Users/me/projects/react/src/actions/index.ts ./src/actions/index.ts [tsl] ERROR in /Users/me/projects/ ...

Разыменование указателя на неполный тип

... задать вопрос по-другому, без 11 специального кода. Есть ли способ ЛЕГКО определить, что 10 является причиной неполного типа? В моем 9 случае я использую чей-то код elses, и я 8 полностью уверен, что у меня нет правильных 7 заголовков, но (поскольку компьютеры делают 6 это намного быстрее и лучше, чем человеческие 5 глазные яб ...

Ошибка C2275: недопустимое использование этого типа в качестве выражения

... before identifier 'DispatchTable' c:\path\main.c(56): error C2065: 'DispatchTable' : undeclared identifier c:\path\main.c(56): error C2059: syntax error : ']' c:\path\main.c(57): error C2065: 'DispatchTable' : undeclared identifier c:\path\main.c(57): warning C4047: 'function' : 'const SERVICE_TABLE_ENTRYA *' differs in levels of indirection from 'int' c:\path\main.c(57): warn ...

Logcat заполнен «input svInfo.flags is 8» во время работы приложения.

... такими сообщениями, как: "? E / GnssHAL_GnssInterface: gnssSvStatusCb: a: входной 3 svInfo.flags равен ...

SassError: недопустимое ожидаемое выражение CSS (например, 1 пиксель, полужирный)

... ss) SassError: Invalid CSS after &quot;...: mis-variables&quot;: expected expression (e.g. 1px, bold), was &quot;.$default-font;&quot; on line 31 of src/App/sass/styles.scss &gt;&gt; font-family: mis-variables.$default-font; ------------------------------^ styles.scss: /* Variables */ @use &quot;mis-variables&quot;; /* SASS Code */ %no-padding { padding ...

Ошибка C2100 - Незаконное косвенное обращение

... ду! Это определение оператора: template &lt;typename T&gt; NumericArray&lt;T&gt; NumericArray&lt;T&gt;::operator * (const int factor) const { NumericArray&lt;T&gt;* TempArray2 = new NumericArray&lt;T&gt;(Size()); for (int i=0; i&lt;Size(); i++) { *TempArray2[i] = ((GetElement(i))*(factor)); } return *TempArray2; } И это реализация 1 в основной функции теста: cout&lt;&lt ...